{"text_format":"3","workbook":"xlsx","n_sheets":9,"sheets":["menu","Reno's","plat dak","Uitleg","matrix","lijst Reno","lijst plat dak","lijst dikte","lijst RC"],"not_rendered":{"charts":8,"images":3,"defined_names":3},"read":"whole","date_system":"1900"}

{"sheet":"menu","index":0,"n_rows":9,"n_cols":2,"rows_kept":9}
[]
[null,"CO2 saver "]
[]
[null,"Met deze tool worden van de geselecteerde producten de milieuprestaties weergegeven, "]
[null,"zoals de MKI-score, Paris proof CO2-emissies en de GWP CO2-emissies*. "]
[null,"Daarnaast biedt de tool de gelegenheid om deze prestaties te vergelijken met "]
[null,"alternatieve producten."]
[]
[null,"Maak een productkeuze"]

{"sheet":"Reno's","index":1,"n_rows":59,"n_cols":10,"rows_kept":59,"merged":[[1,1,1,9],[8,3,8,4],[14,3,14,8],[38,1,38,4],[38,5,38,9],[39,1,39,4],[39,5,39,9],[40,1,40,9],[41,1,41,9],[42,1,42,9],[44,1,46,9]]}
[]
[null,"CO2 saver na-isolatie hellend dak"]
[]
[]
[]
[]
[null,"Product"]
[]
[null,"Type dakelement",{"$nulls":5},"Rc-waarde",null,{"$f":"IF($D$9=\"SlimFix RenoTwin\",\"**\",\" \")","v":" "}]
[]
[null,"Vergelijk de scores met:"]
[]
[null,"Projectgegevens"]
[]
[null,"Projectnaam (optioneel)"]
[]
[null,"Projectgrootte ",null,null,"m2 isolatie"]
[]
[null,"Milieuprestaties"]
{"$rows_empty":19}
{"$rows_left_out":14}
{"sheet":"plat dak","index":2,"n_rows":57,"n_cols":8,"rows_kept":57,"merged":[[1,1,1,9],[8,3,8,4],[14,3,14,8],[38,1,38,4],[38,5,38,9],[39,1,39,4],[39,5,39,9],[40,1,40,9],[41,1,41,9],[42,1,42,9]]}
[]
[null,"CO2 saver plat dakisolatie"]
[]
[]
[]
[]
[null,"Product"]
[]
[null,"Type isolatie",{"$nulls":5},"Dikte"]
[]
[null,"Vergelijk de scores met:",null," ",{"$nulls":3},"Dikte opnieuw selecteren bij "]
[{"$nulls":7},"typeverandering isolatie"]
[null,"Projectgegevens"]
[]
[null,"Projectnaam (optioneel)"]
[]
[null,"Projectgrootte ",null,null,"m2 isolatie"]
[]
[null,"Milieuprestaties"]
{"$rows_empty":19}
{"$rows_left_out":13}
{"sheet":"Uitleg","index":3,"n_rows":31,"n_cols":2,"rows_kept":31,"merged":[[1,1,1,9],[7,1,13,9],[15,1,20,9],[22,1,28,9],[30,1,34,9]]}
[]
[null,"Toelichting milieu-indicatoren"]
[]
[]
[]
[]
[null,"MKI"]
[null,"MKI staat voor Milieu Kosten Index. De index geeft de milieubelasting weer uitgedrukt in Euro's per m2, per jaar. Hoe lager de MKI, hoe lager de milieu-impact en hoe beter de milieuprestatie. De MKI wordt in milieucalculatieprogramma's gebruikt voor de berekening van de wettelijk verplichte Milieu Prestatie Gebouw (MPG). De MKI-scores van onze producten zijn opgenomen in de NMD onder de beste categorie 1."]
[]
[]
[]
[]
[]
[]
[null,"Cradle to Gate"]
[null,"Cradle-to-gate (wieg-tot-poort) is een milieubeoordeling (LCA) die de impact van een product meet vanaf grondstofwinning tot het moment dat het de fabriekspoort verlaat. Het omvat de productie en het energieverbruik, maar exclusief distributie, gebruik en afvalverwerking.  In de LCA komt deze overeen met de CO2-emissies module A1 t/m A3. Cradle to Gate vormt vaak de basis voor de scope 3-emissies."]
[]
[]
[]
[]
{"$rows_left_out":12}
{"sheet":"matrix","index":4,"n_rows":41,"n_cols":7,"rows_kept":41,"hidden":true,"merged":[[3,0,4,0],[3,1,3,3],[13,0,14,0],[13,1,13,3],[15,2,16,2],[15,3,16,3],[23,0,24,0],[23,1,23,3],[33,0,34,0],[33,1,33,3],[35,2,36,2],[35,3,36,3]]}
[]
["Type dakelement",{"$f":"'Reno''s'!D9","v":0},null,"Rc-waarde",{"$f":"'Reno''s'!I9","v":{"v":0,"d":"0.0"}}]
[]
["Product","Milieuprestaties per m2*"]
[null,"MKI","Paris proof","GWP"]
[{"$f":"'lijst Reno'!F26","v":"0 0"},{"$f":"VLOOKUP('lijst Reno'!$F$26,'lijst Reno'!C5:F23,2)","v":{"$error":"#N/A"}},{"$f":"VLOOKUP('lijst Reno'!$F$26,'lijst Reno'!C5:F23,3)","v":{"$error":"#N/A"}},{"$f":"VLOOKUP('lijst Reno'!$F$26,'lijst Reno'!C5:F23,4)","v":{"$error":"#N/A"}}]
[{"$f":"IF(E9=0,\" \",VLOOKUP(matrix!$E$9,'lijst Reno'!E36:I38,2))","v":" "},{"$f":"VLOOKUP(matrix!$E$9,'lijst Reno'!E36:I38,3)","v":{"$error":"#N/A"}},{"$f":"VLOOKUP(matrix!$E$9,'lijst Reno'!E36:I38,4)","v":{"$error":"#N/A"}},{"$f":"VLOOKUP(matrix!$E$9,'lijst Reno'!E36:I38,5)","v":{"$error":"#N/A"}}]
[]
["Vergelijk deze scores met :",{"$nulls":3},{"$f":"'Reno''s'!D11","v":0}]
[]
["Projectgrootte:",{"$nulls":3},{"$f":"IF('Reno''s'!D17=0,\" \",'Reno''s'!D17)","v":" "},"m2"]
[]
[]
["Product","CO2 emissies project"]
[null,{"$f":"IF(A16=\" \",\" \",\"Totaal\")","v":" "},{"$f":"IF(A17=\" \",\" \",\"CO2-besparing\")","v":" "},{"$f":"IF(A17=\" \",\" \",\"Besparing%\")","v":" "}]
[{"$f":"IF(E11=\" \",\" \",'lijst Reno'!F26)","v":" "},{"$f":"IF(A16=\" \",\" \",E11*D6)","v":" "},{"$f":"IF(E11=\" \",\" \",B17-B16)","v":" "},{"$f":"IF(E9=0,\" \",1-(D6/D7))","v":" "},null,null,{"$f":"B17-B16","v":{"$error":"#VALUE!"}}]
[{"$f":"IF(E11=\" \",\" \",VLOOKUP(matrix!$E$9,'lijst Reno'!E36:I38,2))","v":" "},{"$f":"IF(A17=\" \",\" \",E11*D7)","v":" "}]
[]
["aantal km reno",{"$f":"IF(C16=\" \",\" \",C16/0.22)","v":" "}]
["aantal km plat dak",{"$f":"IF(C36=\" \",\" \",C36/0.22)","v":" "}]
{"$rows_left_out":22}
{"sheet":"lijst Reno","index":5,"n_rows":48,"n_cols":19,"rows_kept":48,"hidden":true}
[null,null,1,2,3,4,5,6,7,8,9,10,11,12,13,14,15,16,17]
[{"$nulls":7},74,1.26,1.04]
[]
[null,"RC-waarde",null,"mki","paris proof","GWP",null,"dikte isol","mki","paris proof","GWP",null,"mki","paris proof","GWP",null,"mki","paris proof","GWP"]
["SlimFix Reno+","2.5",{"$f":"A5&\" \"&B5","v":"SlimFix Reno+ 2.5"},{"v":0.444,"d":"0.44"},6,{"v":4.13,"d":"4.1"},"PIR 2.5",51,{"$f":"(($I$2/$H$2)*H5)+$J$2","v":{"v":1.9083783783783783,"d":"1.91"}},11,{"v":14.396,"d":"14.4"},"Vlas 2.5",{"$nulls":3},"Alt.EPS 2.5",{"v":0.549,"d":"0.55"},8,{"v":6.118,"d":"6.1"}]
["SlimFix Reno+","3.0",{"$f":"A6&\" \"&B6","v":"SlimFix Reno+ 3.0"},{"v":0.501,"d":"0.50"},7,{"v":4.773,"d":"4.8"},"PIR 3.0",63,{"$f":"(($I$2/$H$2)*H6)+$J$2","v":{"v":2.1127027027027028,"d":"2.11"}},13,{"v":17.064,"d":"17.1"},"Vlas 3.0",{"$nulls":3},"Alt.EPS 3.0",{"v":0.627,"d":"0.63"},9,{"v":6.994,"d":"7.0"}]
["SlimFix Reno+","3.5","SlimFix Reno+ 3.5",{"v":0.559,"d":"0.56"},8,{"v":5.416,"d":"5.4"},"PIR 3.5",74,2.29,{"v":13.23,"d":"13"},{"v":23.28,"d":"23.3"},"Vlas 3.5",0.97,{"v":9.3,"d":"9"},{"v":6.82,"d":"6.8"},"Alt.EPS 3.5",{"v":0.705,"d":"0.71"},10,{"v":7.871,"d":"7.9"}]
["SlimFix Reno+","4.0","SlimFix Reno+ 4.0",{"v":0.616,"d":"0.62"},9,{"v":6.06,"d":"6.1"},"PIR 4.0",85,{"$f":"(($I$2/$H$2)*H8)+$J$2","v":{"v":2.4872972972972973,"d":"2.49"}},17,{"v":22.398,"d":"22.4"},"Vlas 4.0",{"$nulls":3},"Alt.EPS 4.0",{"v":0.782,"d":"0.78"},11,{"v":8.747,"d":"8.7"}]
["SlimFix Reno+","4.5","SlimFix Reno+ 4.5",{"v":0.674,"d":"0.67"},10,{"v":6.703,"d":"6.7"},"PIR 4.5",96,{"v":2.674594594594595,"d":"2.67"},19,{"v":25.066,"d":"25.1"},"Vlas 4.5",{"$nulls":3},"Alt.EPS 4.5",0.86,13,{"v":9.623,"d":"9.6"}]
["SlimFix Reno+","5.0","SlimFix Reno+ 5.0",{"v":0.731,"d":"0.73"},11,{"v":7.346,"d":"7.3"},"PIR 5.0",107,{"v":2.861891891891892,"d":"2.86"},20,{"v":27.733,"d":"27.7"},"Vlas 5.0",{"$nulls":3},"Alt.EPS 5.0",{"v":0.938,"d":"0.94"},14,{"v":10.499,"d":"10.5"}]
["SlimFix Reno+","6.3","SlimFix Reno+ 6.3",{"v":0.896,"d":"0.90"},13,{"v":9.19,"d":"9.2"},"PIR 6.3",134,{"v":3.3,"d":"3.30"},{"v":22.17,"d":"22"},{"v":37.22,"d":"37.2"},"Vlas 6.3",1.54,{"v":15.22,"d":"15"},{"v":10.98,"d":"11.0"},"Alt.EPS 6.3",{"v":1.139,"d":"1.14"},17,{"v":12.778,"d":"12.8"}]
["SlimFix Reno+","7.0","SlimFix Reno+ 7.0",{"v":0.988,"d":"0.99"},15,{"v":10.22,"d":"10.2"},"PIR 7.0",152,{"$f":"(($I$2/$H$2)*H12)+$J$2","v":{"v":3.628108108108108,"d":"3.63"}},28,{"v":38.403,"d":"38.4"},"Vlas 7.0",{"$nulls":3},"Alt.EPS 7.0",{"v":1.248,"d":"1.25"},19,{"v":14.005,"d":"14.0"}]
["SlimFix Reno+","8.0","SlimFix Reno+ 8.0",{"v":1.099,"d":"1.10"},17,{"v":11.463,"d":"11.5"},"PIR 8.0",175,{"v":4.01972972972973,"d":"4.02"},32,{"v":43.738,"d":"43.7"},"Vlas 8.0",{"$nulls":3},"Alt.EPS 8.0",{"v":1.403,"d":"1.40"},21,{"v":15.757,"d":"15.8"}]
["SlimFix RenoTwin","3.5","SlimFix RenoTwin 3.5",0.49,7,4.6,"PIR 3.0",63,{"$nulls":3},"Vlas 3.0",{"$nulls":3},"Alt.EPS 3.0"]
["SlimFix RenoTwin","4.0","SlimFix RenoTwin 4.0",0.55,8,5.3,"PIR 3.5",74,{"v":2.426,"d":"2.43"},14,{"v":24.118,"d":"24.1"},"Vlas 3.5",0.97,{"v":9.3,"d":"9"},{"v":6.82,"d":"6.8"},"Alt.EPS 3.5",{"v":0.972,"d":"0.97"},12,{"v":9.484,"d":"9.5"}]
["SlimFix RenoTwin","4.5","SlimFix RenoTwin 4.5",0.61,9,{"v":6,"d":"6.0"},"PIR 4.0",85,{"$nulls":3},"Vlas 4.0",{"$nulls":3},"Alt.EPS 4.0",{"v":1.047,"d":"1.05"},13,{"v":10.327,"d":"10.3"}]
["SlimFix RenoTwin","5.0","SlimFix RenoTwin 5.0",0.67,10,6.7,"PIR 4.5",96,{"$nulls":3},"Vlas 4.5",{"$nulls":3},"Alt.EPS 4.5",1.22,14,{"v":11.17,"d":"11.2"}]
["SlimFix RenoTwin","5.5","SlimFix RenoTwin 5.5",0.72,10,7.2,"PIR 5.0",107,{"$nulls":3},"Vlas 5.0",{"$nulls":3},"Alt.EPS 5.0",{"v":1.197,"d":"1.20"},15,{"v":12.013,"d":"12.0"}]
["SlimFix RenoTwin","6.3","SlimFix RenoTwin 6.3",0.81,12,8.2,"PIR 6.0",130,{"$nulls":3},"Vlas 6.0",{"$nulls":3},"Alt.EPS 5.5",{"v":1.271,"d":"1.27"},16,{"v":12.856,"d":"12.9"}]
["SlimFix RenoTwin","6.7","SlimFix RenoTwin 6.7",0.87,13,8.8,"PIR 6.3",134,{"$f":"(I15/I6)*I10","v":{"v":3.2862880900601255,"d":"3.29"}},{"$f":"(J15/J6)*J10","v":{"v":21.538461538461537,"d":"22"}},{"v":39.197403539615564,"d":"39.2"},"Vlas 6.3",1.54,{"v":15.22,"d":"15"},{"v":10.98,"d":"11.0"},"Alt.EPS 6.3",{"v":1.391,"d":"1.39"},18,{"v":14.204,"d":"14.2"}]
{"$rows_left_out":29}
{"sheet":"lijst plat dak","index":6,"n_rows":229,"n_cols":38,"rows_kept":229,"hidden":true}
[{"$nulls":5},1,2,3,4,5,6,7,8,9,10,11,12,13,14,15,16,17,18,19,20,21,22,23,24,25,26,27,28,29,30,31,32,33]
[]
[{"$nulls":5},"LiteTop",235,0.957,14.7,10.747]
[{"$nulls":5},"LiteTop-HR",195,0.766,11.9,8.6]
[{"$nulls":5},"PolyTop",230,1.056,16.3,11.853]
[{"$nulls":5},"PolyTop-HR",195,0.876,13.6,9.84]
[{"$nulls":5},"PowerTop",200,0.877,14.15,9.018]
[{"$nulls":5},"PowerTop Eco30",200,0.843,10.6,8.279,{"$nulls":3},240,3.025,24.8,25.56,{"$nulls":3},246,1.225,11.4,11.4,{"$nulls":3},252,2.333,22.3,25.6,{"$nulls":3},140,{"v":2.957,"d":"2.96"},18.5,24.9]
[null,"dikte",null,null,"Rd",null,null,"mki","C to G","GWP",null,0.038,null,null,"mki","C to G","GWP",null,0.039,null,null,"mki","C to G","GWP",null,0.04,null,null,"mki","C to G","GWP",null,0.022,null,null,"mki","C to G","GWP"]
["LiteTop",100,"mm","Rd",{"v":2.7,"d":"2.70"},{"$f":"A10&\" \"&B10","v":"LiteTop 100"},{"$f":"A10&\" \"&B10&C10&\" \"&D10&\" \"&E10","v":"LiteTop 100mm Rd 2,7"},{"$f":"($H$3/$G$3)*B10","v":{"v":0.4072340425531915,"d":"0.41"}},{"$f":"($I$3/$G$3)*B10","v":{"v":6.25531914893617,"d":"6"}},{"$f":"($J$3/$G$3)*B10","v":{"v":4.573191489361702,"d":"4.6"}},105,{"$f":"FLOOR((K10/1000)/$L$9,0.05)","v":2.75},"Steenwol",{"$f":"M10&\" \"&K10&C10&\" \"&D10&\" \"&L10","v":"Steenwol 105mm Rd 2,75"},{"$f":"($O$8/$N$8)*K10","v":{"v":1.3234375,"d":"1.32"}},{"$f":"($P$8/$N$8)*K10","v":{"v":10.85,"d":"11"}},{"$f":"($Q$8/$N$8)*K10","v":{"v":11.1825,"d":"11.2"}},105,{"$f":"FLOOR((R10/1000)/$S$9,0.05)","v":{"v":2.6500000000000004,"d":"2.65"}},"kurk",{"$f":"T10&\" \"&R10&C10&\" \"&D10&\" \"&S10","v":"kurk 105mm Rd 2,65"},{"$f":"($V$8/$U$8)*R10","v":{"v":0.5228658536585367,"d":"0.52"}},{"$f":"($W$8/$U$8)*R10","v":{"v":4.865853658536586,"d":"5"}},{"$f":"($X$8/$U$8)*R10","v":{"v":4.865853658536586,"d":"4.9"}},110,{"$f":"FLOOR((Y10/1000)/$Z$9,0.05)","v":2.75},"Houtvezel",{"$f":"AA10&\" \"&Y10&C10&\" \"&D10&\" \"&Z10","v":"Houtvezel 110mm Rd 2,75"},{"$f":"($AC$8/$AB$8)*Y10","v":{"v":1.018373015873016,"d":"1.02"}},{"$f":"($AD$8/$AB$8)*Y10","v":{"v":9.734126984126984,"d":"10"}},{"$f":"($AE$8/$AB$8)*Y10","v":{"v":11.174603174603174,"d":"11.2"}},60,{"$f":"FLOOR((AF10/1000)/$AG$9,0.05)","v":{"v":2.7,"d":"2.70"}},"PIR",{"$f":"AH10&\" \"&AF10&C10&\" \"&D10&\" \"&AG10","v":"PIR 60mm Rd 2,7"},{"$f":"($AJ$8/$AI$8)*AF10","v":{"v":1.2672857142857141,"d":"1.27"}},{"$f":"($AK$8/$AI$8)*AF10","v":{"v":7.928571428571429,"d":"8"}},{"$f":"($AL$8/$AI$8)*AF10","v":{"v":10.67142857142857,"d":"10.7"}}]
["LiteTop",110,"mm","Rd",2.95,"LiteTop 110","LiteTop 110mm Rd 2,95",{"$f":"($H$3/$G$3)*B11","v":{"v":0.4479574468085107,"d":"0.45"}},{"$f":"($I$3/$G$3)*B11","v":{"v":6.880851063829787,"d":"7"}},{"$f":"($J$3/$G$3)*B11","v":{"v":5.030510638297872,"d":"5.0"}},115,{"v":3,"d":"3.00"},"Steenwol","Steenwol 115mm Rd 3",{"v":1.4494791666666667,"d":"1.45"},{"v":11.883333333333333,"d":"12"},{"v":12.2475,"d":"12.2"},115,{"v":2.9000000000000004,"d":"2.90"},"kurk","kurk 115mm Rd 2,9",{"v":0.5726626016260163,"d":"0.57"},{"v":5.329268292682927,"d":"5"},{"v":5.329268292682927,"d":"5.3"},120,{"v":3,"d":"3.00"},"Houtvezel","Houtvezel 120mm Rd 3",{"v":1.110952380952381,"d":"1.11"},{"v":10.61904761904762,"d":"11"},{"v":12.19047619047619,"d":"12.2"},65,2.95,"PIR","PIR 65mm Rd 2,95",{"v":1.372892857142857,"d":"1.37"},{"v":8.589285714285715,"d":"9"},{"v":11.560714285714285,"d":"11.6"}]
["LiteTop",120,"mm","Rd",{"v":3.2,"d":"3.20"},"LiteTop 120","LiteTop 120mm Rd 3,2",{"v":0.4886808510638298,"d":"0.49"},{"v":7.506382978723404,"d":"8"},{"v":5.487829787234042,"d":"5.5"},120,{"v":3.1500000000000004,"d":"3.15"},"Steenwol","Steenwol 120mm Rd 3,15",{"v":1.5125,"d":"1.51"},{"v":12.4,"d":"12"},{"v":12.78,"d":"12.8"},125,{"v":3.2,"d":"3.20"},"kurk","kurk 125mm Rd 3,2",{"v":0.622459349593496,"d":"0.62"},{"v":5.7926829268292686,"d":"6"},{"v":5.7926829268292686,"d":"5.8"},130,3.25,"Houtvezel","Houtvezel 130mm Rd 3,25",{"v":1.203531746031746,"d":"1.20"},{"v":11.503968253968255,"d":"12"},{"v":13.206349206349206,"d":"13.2"},70,{"v":3.1500000000000004,"d":"3.15"},"PIR","PIR 70mm Rd 3,15",{"v":1.4785,"d":"1.48"},{"v":9.25,"d":"9"},{"v":12.45,"d":"12.5"}]
["LiteTop",130,"mm","Rd",{"v":3.5,"d":"3.50"},"LiteTop 130","LiteTop 130mm Rd 3,5",{"v":0.5294042553191489,"d":"0.53"},{"v":8.13191489361702,"d":"8"},{"v":5.945148936170212,"d":"5.9"},135,{"v":3.5500000000000003,"d":"3.55"},"Steenwol","Steenwol 135mm Rd 3,55",{"v":1.7015624999999999,"d":"1.70"},{"v":13.95,"d":"14"},{"v":14.3775,"d":"14.4"},140,{"v":3.5500000000000003,"d":"3.55"},"kurk","kurk 140mm Rd 3,55",{"v":0.6971544715447155,"d":"0.70"},{"v":6.48780487804878,"d":"6"},{"v":6.48780487804878,"d":"6.5"},140,{"v":3.5,"d":"3.50"},"Houtvezel","Houtvezel 140mm Rd 3,5",{"v":1.2961111111111112,"d":"1.30"},{"v":12.38888888888889,"d":"12"},{"v":14.222222222222221,"d":"14.2"},75,{"v":3.4000000000000004,"d":"3.40"},"PIR","PIR 75mm Rd 3,4",{"v":1.5841071428571427,"d":"1.58"},{"v":9.910714285714286,"d":"10"},{"v":13.339285714285714,"d":"13.3"}]
["LiteTop",140,"mm","Rd",3.75,"LiteTop 140","LiteTop 140mm Rd 3,75",{"v":0.5701276595744681,"d":"0.57"},{"v":8.757446808510638,"d":"9"},{"v":6.402468085106383,"d":"6.4"},140,{"v":3.6500000000000004,"d":"3.65"},"Steenwol","Steenwol 140mm Rd 3,65",{"v":1.7645833333333334,"d":"1.76"},{"v":14.466666666666667,"d":"14"},{"v":14.91,"d":"14.9"},145,{"v":3.7,"d":"3.70"},"kurk","kurk 145mm Rd 3,7",{"v":0.7220528455284554,"d":"0.72"},{"v":6.719512195121951,"d":"7"},{"v":6.719512195121951,"d":"6.7"},150,3.75,"Houtvezel","Houtvezel 150mm Rd 3,75",{"v":1.3886904761904764,"d":"1.39"},{"v":13.273809523809524,"d":"13"},{"v":15.238095238095237,"d":"15.2"},85,3.85,"PIR","PIR 85mm Rd 3,85",{"v":1.7953214285714283,"d":"1.80"},{"v":11.232142857142858,"d":"11"},{"v":15.117857142857142,"d":"15.1"}]
["LiteTop",150,"mm","Rd",4.05,"LiteTop 150","LiteTop 150mm Rd 4,05",{"v":0.6108510638297873,"d":"0.61"},{"v":9.382978723404255,"d":"9"},{"v":6.859787234042553,"d":"6.9"},155,4.05,"Steenwol","Steenwol 155mm Rd 4,05",{"v":1.9536458333333333,"d":"1.95"},{"v":16.016666666666666,"d":"16"},{"v":16.5075,"d":"16.5"},160,{"v":4.1000000000000005,"d":"4.10"},"kurk","kurk 160mm Rd 4,1",{"v":0.7967479674796749,"d":"0.80"},{"v":7.414634146341463,"d":"7"},{"v":7.414634146341463,"d":"7.4"},160,{"v":4,"d":"4.00"},"Houtvezel","Houtvezel 160mm Rd 4",{"v":1.4812698412698413,"d":"1.48"},{"v":14.15873015873016,"d":"14"},{"v":16.253968253968253,"d":"16.3"},90,4.05,"PIR","PIR 90mm Rd 4,05",{"v":1.900928571428571,"d":"1.90"},{"v":11.892857142857142,"d":"12"},{"v":16.007142857142856,"d":"16.0"}]
["LiteTop",160,"mm","Rd",{"v":4.3,"d":"4.30"},"LiteTop 160","LiteTop 160mm Rd 4,3",{"v":0.6515744680851064,"d":"0.65"},{"v":10.00851063829787,"d":"10"},{"v":7.317106382978723,"d":"7.3"},165,{"v":4.3,"d":"4.30"},"Steenwol","Steenwol 165mm Rd 4,3",{"v":2.0796875,"d":"2.08"},{"v":17.05,"d":"17"},{"v":17.572499999999998,"d":"17.6"},170,{"v":4.3500000000000005,"d":"4.35"},"kurk","kurk 170mm Rd 4,35",{"v":0.8465447154471545,"d":"0.85"},{"v":7.878048780487805,"d":"8"},{"v":7.878048780487805,"d":"7.9"},170,4.25,"Houtvezel","Houtvezel 170mm Rd 4,25",{"v":1.5738492063492064,"d":"1.57"},{"v":15.043650793650794,"d":"15"},{"v":17.26984126984127,"d":"17.3"},95,{"v":4.3,"d":"4.30"},"PIR","PIR 95mm Rd 4,3",{"v":2.006535714285714,"d":"2.01"},{"v":12.553571428571429,"d":"13"},{"v":16.896428571428572,"d":"16.9"}]
["LiteTop",170,"mm","Rd",4.55,"LiteTop 170","LiteTop 170mm Rd 4,55",{"v":0.6922978723404256,"d":"0.69"},{"v":10.634042553191488,"d":"11"},{"v":7.774425531914893,"d":"7.8"},175,{"v":4.6000000000000005,"d":"4.60"},"Steenwol","Steenwol 175mm Rd 4,6",{"v":2.2057291666666665,"d":"2.21"},{"v":18.083333333333332,"d":"18"},{"v":18.6375,"d":"18.6"},180,{"v":4.6000000000000005,"d":"4.60"},"kurk","kurk 180mm Rd 4,6",{"v":0.8963414634146342,"d":"0.90"},{"v":8.341463414634147,"d":"8"},{"v":8.341463414634147,"d":"8.3"},180,{"v":4.5,"d":"4.50"},"Houtvezel","Houtvezel 180mm Rd 4,5",{"v":1.6664285714285716,"d":"1.67"},{"v":15.928571428571429,"d":"16"},{"v":18.285714285714285,"d":"18.3"},100,{"v":4.5,"d":"4.50"},"PIR","PIR 100mm Rd 4,5",{"v":2.1121428571428567,"d":"2.11"},{"v":13.214285714285715,"d":"13"},{"v":17.785714285714285,"d":"17.8"}]
["LiteTop",180,"mm","Rd",4.85,"LiteTop 180","LiteTop 180mm Rd 4,85",{"v":0.7330212765957447,"d":"0.73"},{"v":11.259574468085106,"d":"11"},{"v":8.231744680851063,"d":"8.2"},185,{"v":4.8500000000000005,"d":"4.85"},"Steenwol","Steenwol 185mm Rd 4,85",{"v":2.331770833333333,"d":"2.33"},{"v":19.116666666666667,"d":"19"},{"v":19.7025,"d":"19.7"},190,{"v":4.8500000000000005,"d":"4.85"},"kurk","kurk 190mm Rd 4,85",{"v":0.9461382113821138,"d":"0.95"},{"v":8.804878048780488,"d":"9"},{"v":8.804878048780488,"d":"8.8"},195,{"v":4.8500000000000005,"d":"4.85"},"Houtvezel","Houtvezel 195mm Rd 4,85",{"v":1.805297619047619,"d":"1.81"},{"v":17.255952380952383,"d":"17"},{"v":19.80952380952381,"d":"19.8"},105,4.75,"PIR","PIR 105mm Rd 4,75",{"v":2.2177499999999997,"d":"2.22"},{"v":13.875,"d":"14"},{"v":18.675,"d":"18.7"}]
["LiteTop",190,"mm","Rd",{"v":5.1,"d":"5.10"},"LiteTop 190","LiteTop 190mm Rd 5,1",{"v":0.7737446808510638,"d":"0.77"},{"v":11.885106382978723,"d":"12"},{"v":8.689063829787234,"d":"8.7"},195,{"v":5.1000000000000005,"d":"5.10"},"Steenwol","Steenwol 195mm Rd 5,1",{"v":2.4578124999999997,"d":"2.46"},{"v":20.15,"d":"20"},{"v":20.7675,"d":"20.8"},200,{"v":5.1000000000000005,"d":"5.10"},"kurk","kurk 200mm Rd 5,1",{"v":0.9959349593495935,"d":"1.00"},{"v":9.268292682926829,"d":"9"},{"v":9.268292682926829,"d":"9.3"},205,{"v":5.1000000000000005,"d":"5.10"},"Houtvezel","Houtvezel 205mm Rd 5,1",{"v":1.8978769841269842,"d":"1.90"},{"v":18.140873015873016,"d":"18"},{"v":20.825396825396826,"d":"20.8"},110,{"v":5,"d":"5.00"},"PIR","PIR 110mm Rd 5",{"v":2.3233571428571427,"d":"2.32"},{"v":14.535714285714286,"d":"15"},{"v":19.564285714285713,"d":"19.6"}]
["LiteTop",200,"mm","Rd",{"v":5.4,"d":"5.40"},"LiteTop 200","LiteTop 200mm Rd 5,4",{"v":0.814468085106383,"d":"0.81"},{"v":12.51063829787234,"d":"13"},{"v":9.146382978723404,"d":"9.1"},205,{"v":5.3500000000000005,"d":"5.35"},"Steenwol","Steenwol 205mm Rd 5,35",{"v":2.583854166666667,"d":"2.58"},{"v":21.183333333333334,"d":"21"},{"v":21.8325,"d":"21.8"},210,{"v":5.3500000000000005,"d":"5.35"},"kurk","kurk 210mm Rd 5,35",{"v":1.0457317073170733,"d":"1.05"},{"v":9.731707317073171,"d":"10"},{"v":9.731707317073171,"d":"9.7"},215,{"v":5.3500000000000005,"d":"5.35"},"Houtvezel","Houtvezel 215mm Rd 5,35",{"v":1.9904563492063494,"d":"1.99"},{"v":19.025793650793652,"d":"19"},{"v":21.841269841269842,"d":"21.8"},120,5.45,"PIR","PIR 120mm Rd 5,45",{"v":2.5345714285714283,"d":"2.53"},{"v":15.857142857142858,"d":"16"},{"v":21.34285714285714,"d":"21.3"}]
{"$rows_left_out":210}
{"sheet":"lijst dikte","index":7,"n_rows":46,"n_cols":8,"rows_kept":46,"hidden":true}
[{"$f":"matrix!B22","v":0},"LiteTop","LiteTop HR","PolyTop","PolyTop HR","PowerTop","PowerTop Eco30","ATTENTIE: type op alfabetische volgorde"]
[{"$f":"IF(HLOOKUP($A$1,$B$1:$F$46,2)>0,HLOOKUP($A$1,$B$1:$F$46,2),\" \")","v":{"$error":"#N/A"}},40,40,40,40,180,180]
[{"$f":"IF(HLOOKUP($A$1,$B$1:$F$46,3)>0,HLOOKUP($A$1,$B$1:$F$46,3),\" \")","v":{"$error":"#N/A"}},50,50,50,50,185,185]
[{"$f":"IF(HLOOKUP($A$1,$B$1:$F$46,4)>0,HLOOKUP($A$1,$B$1:$F$46,4),\" \")","v":{"$error":"#N/A"}},60,60,60,60,190,190]
[{"$f":"IF(HLOOKUP($A$1,$B$1:$F$46,5)>0,HLOOKUP($A$1,$B$1:$F$46,5),\" \")","v":{"$error":"#N/A"}},70,70,70,70,195,195]
[{"$f":"IF(HLOOKUP($A$1,$B$1:$F$46,6)>0,HLOOKUP($A$1,$B$1:$F$46,6),\" \")","v":{"$error":"#N/A"}},80,80,80,80,200,200]
[{"$f":"IF(HLOOKUP($A$1,$B$1:$F$46,7)>0,HLOOKUP($A$1,$B$1:$F$46,7),\" \")","v":{"$error":"#N/A"}},90,90,90,90,205,205]
[{"$f":"IF(HLOOKUP($A$1,$B$1:$F$46,8)>0,HLOOKUP($A$1,$B$1:$F$46,8),\" \")","v":{"$error":"#N/A"}},100,100,100,100,210,210]
[{"$f":"IF(HLOOKUP($A$1,$B$1:$F$46,9)>0,HLOOKUP($A$1,$B$1:$F$46,9),\" \")","v":{"$error":"#N/A"}},110,110,110,110,215,215]
[{"$f":"IF(HLOOKUP($A$1,$B$1:$F$46,10)>0,HLOOKUP($A$1,$B$1:$F$46,10),\" \")","v":{"$error":"#N/A"}},120,120,120,120,220,220]
[{"$f":"IF(HLOOKUP($A$1,$B$1:$F$46,11)>0,HLOOKUP($A$1,$B$1:$F$46,11),\" \")","v":{"$error":"#N/A"}},130,130,130,130,225,225]
[{"$f":"IF(HLOOKUP($A$1,$B$1:$F$46,12)>0,HLOOKUP($A$1,$B$1:$F$46,12),\" \")","v":{"$error":"#N/A"}},140,140,140,140,230,230]
[{"$f":"IF(HLOOKUP($A$1,$B$1:$F$46,13)>0,HLOOKUP($A$1,$B$1:$F$46,13),\" \")","v":{"$error":"#N/A"}},150,150,150,150,235,235]
[{"$f":"IF(HLOOKUP($A$1,$B$1:$F$46,14)>0,HLOOKUP($A$1,$B$1:$F$46,14),\" \")","v":{"$error":"#N/A"}},160,160,160,160,240,240]
[{"$f":"IF(HLOOKUP($A$1,$B$1:$F$46,15)>0,HLOOKUP($A$1,$B$1:$F$46,15),\" \")","v":{"$error":"#N/A"}},170,170,170,170,245,245]
[{"$f":"IF(HLOOKUP($A$1,$B$1:$F$46,16)>0,HLOOKUP($A$1,$B$1:$F$46,16),\" \")","v":{"$error":"#N/A"}},180,180,180,180,250,250]
[{"$f":"IF(HLOOKUP($A$1,$B$1:$F$46,17)>0,HLOOKUP($A$1,$B$1:$F$46,17),\" \")","v":{"$error":"#N/A"}},190,190,190,190,255,255]
[{"$f":"IF(HLOOKUP($A$1,$B$1:$F$46,18)>0,HLOOKUP($A$1,$B$1:$F$46,18),\" \")","v":{"$error":"#N/A"}},200,200,200,200,260,260]
[{"$f":"IF(HLOOKUP($A$1,$B$1:$F$46,19)>0,HLOOKUP($A$1,$B$1:$F$46,19),\" \")","v":{"$error":"#N/A"}},210,210,210,210,265,265]
[{"$f":"IF(HLOOKUP($A$1,$B$1:$F$46,20)>0,HLOOKUP($A$1,$B$1:$F$46,20),\" \")","v":{"$error":"#N/A"}},220,220,220,220,270,270]
{"$rows_left_out":27}
{"sheet":"lijst RC","index":8,"n_rows":3,"n_cols":4,"rows_kept":3,"hidden":true}
[{"$f":"matrix!B2","v":0},"SlimFix Reno+","SlimFix RenoTwin","ATTENTIE: type op alfabetische volgorde"]
[{"$f":"IF(HLOOKUP($A$1,B1:C3,2)>0,HLOOKUP($A$1,B1:C3,2),\" \")","v":{"$error":"#N/A"}},"3.5","3.5"]
[{"$f":"IF(HLOOKUP($A$1,$B$1:$C$3,3)>0,HLOOKUP($A$1,$B$1:$C$3,3),\" \")","v":{"$error":"#N/A"}},"6.3","6.3"]